BDBM447398 US10688093, Compound BF000817170::US11701353, Compound BF000817170
SMILES C(Nc1ccc2ncc(-c3ccncc3)n2n1)c1ccccn1
InChI Key InChIKey=FWTNNPUBUXYQJX-UHFFFAOYSA-N
Data  2 IC50
  Tab Delimited (TSV)   2D SDfile   Computed 3D by Vconf -m prep SDfile
Find this compound or compounds like it in BindingDB:
Activity Spreadsheet -- Enzyme Inhibition Constant Data from BindingDB
Found 2 hits for monomerid = 447398
TargetTyrosine-protein kinase Fyn(Homo sapiens (Human))
Pathways Neuro Pharma
US Patent
LigandPNGBDBM447398(US10688093, Compound BF000817170 | US11701353, Com...)
Affinity DataIC50:  170nM. Assay description: The ADP-Glo™ Kinase Assay is specifically designed to quantify kinase activity by measuring the ADP produced in the reaction The reaction buffer...
Ligand InfoPC cidPC sid
TargetTyrosine-protein kinase Fyn(Homo sapiens (Human))
Pathways Neuro Pharma
US Patent
LigandPNGBDBM447398(US10688093, Compound BF000817170 | US11701353, Com...)
Affinity DataIC50:  170nM. Assay description: The assay procedure determines the IC50 of each potential FYN kinase inhibitor by measuring the enzyme catalyzed ATP-dependent phosphorylation of the...
Ligand InfoPC cidPC sid
In DepthDetails US Patent