BDBM447647 6-((3-methoxy-4-(thiophen-3-ylmethoxy)phenyl)amino)-3-morpholinoquinoxaline-5-carbonitrile::US10689362, Example 126
SMILES COc1cc(Nc2ccc3ncc(nc3c2C#N)N2CCOCC2)ccc1OCc1ccsc1
InChI Key InChIKey=QROYYFCAFXPHSG-UHFFFAOYSA-N
Data  1 KI  3 IC50
  Tab Delimited (TSV)   2D SDfile   Computed 3D by Vconf -m prep SDfile
Find this compound or compounds like it in BindingDB:
Activity Spreadsheet -- Enzyme Inhibition Constant Data from BindingDB
Found 4 hits for monomerid = 447647
TargetMast/stem cell growth factor receptor Kit(Homo sapiens (Human))
Development Center For Biotechnology
US Patent
LigandPNGBDBM447647(6-((3-methoxy-4-(thiophen-3-ylmethoxy)phenyl)amino...)
Affinity DataKi:  27.5nM. Assay description: c-KIT: Inhibition of c-KIT kinase activity by a test compound disclosed herein was estimated by radiometric assay. Standard assay conditions were 20 ...
Ligand InfoPC cidPC sid
In DepthDetails US Patent
TargetPlatelet-derived growth factor receptor beta(Homo sapiens (Human))
Development Center For Biotechnology
US Patent
LigandPNGBDBM447647(6-((3-methoxy-4-(thiophen-3-ylmethoxy)phenyl)amino...)
Affinity DataIC50: >1.00E+6nM. Assay description: PDGFRβ: Inhibition of PDGFRβ kinase activity by a test compound disclosed herein was estimated by radiometric assay. Standard assay conditi...
Ligand InfoPC cidPC sid
In DepthDetails US Patent
TargetReceptor-type tyrosine-protein kinase FLT3(Homo sapiens (Human))
Development Center For Biotechnology
US Patent
LigandPNGBDBM447647(6-((3-methoxy-4-(thiophen-3-ylmethoxy)phenyl)amino...)
Affinity DataIC50: >1.00E+6nM. Assay description: FLT3: Inhibition of FLT3 kinase activity by a test compound disclosed herein was estimated by radiometric assay. Standard assay conditions were 5 ng ...
Ligand InfoPC cidPC sid
In DepthDetails US Patent
TargetMacrophage colony-stimulating factor 1 receptor(Homo sapiens (Human))
Development Center For Biotechnology
US Patent
LigandPNGBDBM447647(6-((3-methoxy-4-(thiophen-3-ylmethoxy)phenyl)amino...)
Affinity DataIC50:  27.5nM. Assay description: CSF-1R: Inhibition of CSF-1R kinase activity by a test compound disclosed herein was estimated by AlphaScreen (PerkinElmer). Standard assay condition...
Ligand InfoPC cidPC sid
In DepthDetails US Patent