BDBM447744 US10689367, Example 63.0
SMILES COCC1(CC1)n1c(NS(=O)(=O)[C@@H](C)[C@@H](OC(C)C)c2ncc(C)cn2)nnc1-c1cncc(C)c1
InChI Key InChIKey=FUGNIGIQYWFOMO-AZUAARDMSA-N
Data  1 EC50
  Tab Delimited (TSV)   2D SDfile   Computed 3D by Vconf -m prep SDfile
Find this compound or compounds like it in BindingDB:
Activity Spreadsheet -- Enzyme Inhibition Constant Data from BindingDB
Found 1 hit for monomerid = 447744
TargetApelin receptor(Homo sapiens (Human))
Amgen
US Patent
LigandPNGBDBM447744(US10689367, Example 63.0)
Affinity DataEC50:  20nM. Assay description: The human APJ receptor was cloned by polymerase chain reaction and the gene encoding the receptor was subcloned in pFLAG-CMV™-3 expression vector (Si...
Ligand InfoPC cidPC sid
In DepthDetails US Patent