BDBM447858 US10689367, Example 186.0
SMILES CO[C@@H]([C@H](C)S(=O)(=O)Nc1nnc(-c2cccc(OC)n2)n1Cc1cnoc1)c1ncc(Cl)cn1
InChI Key InChIKey=LLSYMSPYVRGFTD-SJCJKPOMSA-N
Data  1 EC50
  Tab Delimited (TSV)   2D SDfile   Computed 3D by Vconf -m prep SDfile
Find this compound or compounds like it in BindingDB:
Activity Spreadsheet -- Enzyme Inhibition Constant Data from BindingDB
Found 1 hit for monomerid = 447858
TargetApelin receptor(Homo sapiens (Human))
Amgen
US Patent
LigandPNGBDBM447858(US10689367, Example 186.0)
Affinity DataEC50:  98nM. Assay description: The human APJ receptor was cloned by polymerase chain reaction and the gene encoding the receptor was subcloned in pFLAG-CMV™-3 expression vector (Si...
Ligand InfoPC cidPC sid
In DepthDetails US Patent