BDBM448038 US10689376, Compound 35::US11142524, Compound 35
SMILES COc1ccc(NC(=O)CSc2nc3cnc(Cl)cc3[nH]2)cc1OC(F)(F)F
InChI Key InChIKey=ZWTQPZNKUASSKA-UHFFFAOYSA-N
Data  2 IC50
  Tab Delimited (TSV)   2D SDfile   Computed 3D by Vconf -m prep SDfile
Find this compound or compounds like it in BindingDB:
Activity Spreadsheet -- Enzyme Inhibition Constant Data from BindingDB
Found 2 hits for monomerid = 448038
TargetEctonucleotide pyrophosphatase/phosphodiesterase family member 1(Homo sapiens (Human))
Stingray Therapeutics
US Patent
LigandPNGBDBM448038(US10689376, Compound 35 | US11142524, Compound 35)
Affinity DataIC50:  4.07E+4nM. Assay description: Materials:Assay Buffer: 1 mM CaCl2, 0.2 mM ZnCl2, 50 mM Tris, pH 9.0. Substrate: 8 mM Thymidine 5′-monophosphate p-nitrophenol ester sodium sal...
Ligand InfoPC cidPC sid
In DepthDetails US Patent
TargetEctonucleotide pyrophosphatase/phosphodiesterase family member 1(Homo sapiens (Human))
Stingray Therapeutics
US Patent
LigandPNGBDBM448038(US10689376, Compound 35 | US11142524, Compound 35)
Affinity DataIC50:  4.07E+4nM. Assay description: Materials: Assay Buffer: 1 mM CaCl2, 0.2 mM ZnCl2, 50 mM Tris, pH 9.0 Substrate: 8 mM Thymidine 5′-monophosphate p-nitrophenol es...
Ligand InfoPC cidPC sid
In DepthDetails US Patent