BDBM448044 US10689376, Compound 61::US11142524, Compound 61
SMILES Oc1cc(NC(=O)CSc2nc3cc(ncc3[nH]2)C(F)(F)F)ccc1OC(F)(F)F
InChI Key InChIKey=RZPGRZKTRQJRSS-UHFFFAOYSA-N
Data  2 IC50
  Tab Delimited (TSV)   2D SDfile   Computed 3D by Vconf -m prep SDfile
Find this compound or compounds like it in BindingDB:
Activity Spreadsheet -- Enzyme Inhibition Constant Data from BindingDB
Found 2 hits for monomerid = 448044
TargetEctonucleotide pyrophosphatase/phosphodiesterase family member 1(Homo sapiens (Human))
Stingray Therapeutics
US Patent
LigandPNGBDBM448044(US10689376, Compound 61 | US11142524, Compound 61)
Affinity DataIC50:  2.26E+4nM. Assay description: Materials:Assay Buffer: 1 mM CaCl2, 0.2 mM ZnCl2, 50 mM Tris, pH 9.0. Substrate: 8 mM Thymidine 5′-monophosphate p-nitrophenol ester sodium sal...
Ligand InfoPC cidPC sid
In DepthDetails US Patent
TargetEctonucleotide pyrophosphatase/phosphodiesterase family member 1(Homo sapiens (Human))
Stingray Therapeutics
US Patent
LigandPNGBDBM448044(US10689376, Compound 61 | US11142524, Compound 61)
Affinity DataIC50:  2.26E+4nM. Assay description: Materials: Assay Buffer: 1 mM CaCl2, 0.2 mM ZnCl2, 50 mM Tris, pH 9.0 Substrate: 8 mM Thymidine 5′-monophosphate p-nitrophenol es...
Ligand InfoPC cidPC sid
In DepthDetails US Patent