BDBM448153 US10689369, Example 11A
SMILES CN(C)[C@@H]1CCN(C1)C(=O)[C@@H]1CCc2c(C1)n(nc2C1=CCC(CC1)C(O)=O)C(=O)c1c(Cl)cccc1C1(F)CCC1
InChI Key InChIKey=MQCOGKDIJNFWIR-HRUVVLKGSA-N
Data  1 IC50
  Tab Delimited (TSV)   2D SDfile   Computed 3D by Vconf -m prep SDfile
Find this compound or compounds like it in BindingDB:
Activity Spreadsheet -- Enzyme Inhibition Constant Data from BindingDB
Found 1 hit for monomerid = 448153
TargetNuclear receptor ROR-gamma(Homo sapiens (Human))
Merck Sharp & Dohme
US Patent
LigandPNGBDBM448153(US10689369, Example 11A)
Affinity DataIC50:  62nM. Assay description: The compounds of the invention inhibit RORgammaT activity. Activation of RORgammaT activity can be measured using, e.g., biochemical TR-FRET assay. I...
Ligand InfoPC cidPC sid
In DepthDetails US Patent