BDBM448162 4-(((2R,6S)-4-ethyl-2- methyl-3-oxo-1-oxa-4,9- diazaspiro[5.6]dodecan-9- yl)methyl)benzonitrile::US10689398, Example 67
SMILES CCN1C[C@@]2(CCCN(Cc3ccc(cc3)C#N)CC2)O[C@H](C)C1=O
InChI Key InChIKey=YYLPDSFHMKRZDB-UZLBHIALSA-N
Data  1 KI
  Tab Delimited (TSV)   2D SDfile   Computed 3D by Vconf -m prep SDfile
Find this compound or compounds like it in BindingDB:
Activity Spreadsheet -- Enzyme Inhibition Constant Data from BindingDB
Found 1 hit for monomerid = 448162
TargetSigma non-opioid intracellular receptor 1(Homo sapiens (Human))
Esteve Pharmaceuticals
US Patent
LigandPNGBDBM448162(4-(((2R,6S)-4-ethyl-2- methyl-3-oxo-1-oxa-4,9- dia...)
Affinity DataKi: >500nM. Assay description: To investigate binding properties of test compounds to human σ1 receptor, transfected HEK-293 membranes and [3H](+)-pentazocine (Perkin Elmer, N...
Ligand InfoPC cidPC sid
In DepthDetails US Patent