BDBM448174 (S)-8-isopropyl-6- methyl-2-neopentyl-5-oxa- 2,8-diazaspiro[3.5]nonan- 7-one::US10689398, Example 76
SMILES CC(C)N1CC2(CN(CC(C)(C)C)C2)O[C@@H](C)C1=O
InChI Key InChIKey=XKWNQRFKBYAEST-LBPRGKRZSA-N
Data  1 KI
  Tab Delimited (TSV)   2D SDfile   Computed 3D by Vconf -m prep SDfile
Find this compound or compounds like it in BindingDB:
Activity Spreadsheet -- Enzyme Inhibition Constant Data from BindingDB
Found 1 hit for monomerid = 448174
TargetSigma non-opioid intracellular receptor 1(Homo sapiens (Human))
Esteve Pharmaceuticals
US Patent
LigandPNGBDBM448174((S)-8-isopropyl-6- methyl-2-neopentyl-5-oxa- 2,8-d...)
Affinity DataKi: >500nM. Assay description: To investigate binding properties of test compounds to human σ1 receptor, transfected HEK-293 membranes and [3H](+)-pentazocine (Perkin Elmer, N...
Ligand InfoPC cidPC sid
In DepthDetails US Patent