BDBM448198 US10689399, Compound 13
SMILES C[C@@H](NC(=O)c1cn2CC3O[C@@H]4CC[C@H](C4)N3C(=O)c2c(O)c1=O)c1ccc(F)cc1F
InChI Key InChIKey=HZQGBUQIMZZLDE-VGWNDNRCSA-N
Data  1 IC50
  Tab Delimited (TSV)   2D SDfile   Computed 3D by Vconf -m prep SDfile
Find this compound or compounds like it in BindingDB:
Activity Spreadsheet -- Enzyme Inhibition Constant Data from BindingDB
Found 1 hit for monomerid = 448198
TargetPOU domain, class 2, transcription factor 2(Homo sapiens (Human))
Gilead Sciences
US Patent
LigandPNGBDBM448198(US10689399, Compound 13)
Affinity DataIC50:  610nM. Assay description: The dose dependent inhibition of OCT2 mediated uptake of a model substrate 14C-Tetraethylammonium (TEA) by test compounds was studied in wild-type an...
Ligand InfoPC cidPC sid
In DepthDetails US Patent