BDBM448262 US10689705, Compound 39
SMILES Cc1nc2cc(ccc2[nH]1)-n1ncc(C(=O)c2cc3cc(OCC4CC4)ccc3[nH]2)c1N
InChI Key InChIKey=HEVVAJIKBWBWSD-UHFFFAOYSA-N
Data  3 IC50
  Tab Delimited (TSV)   2D SDfile   Computed 3D by Vconf -m prep SDfile
Find this compound or compounds like it in BindingDB:
Activity Spreadsheet -- Enzyme Inhibition Constant Data from BindingDB
Found 3 hits for monomerid = 448262
TargetFibroblast growth factor receptor 1(Homo sapiens (Human))
Chugai Seiyaku Kabushiki Kaisha
US Patent
LigandPNGBDBM448262(US10689705, Compound 39)
Affinity DataIC50:  24nM. Assay description: The FGFR1 inhibitory activities of compounds were measured based on their activity to inhibit phosphorylation of the biotinylated peptide (EGPWLEEEEE...
Ligand InfoPC cidPC sid
In DepthDetails US Patent
TargetFibroblast growth factor receptor 3(Homo sapiens (Human))
Chugai Seiyaku Kabushiki Kaisha
US Patent
LigandPNGBDBM448262(US10689705, Compound 39)
Affinity DataIC50:  370nM. Assay description: The FGFR3 inhibitory activities of compounds listed in Tables 1-1 to 1-5 were measured based on their activity to inhibit phosphorylation of the biot...
Ligand InfoPC cidPC sid
In DepthDetails US Patent
TargetFibroblast growth factor receptor 2(Homo sapiens (Human))
Chugai Seiyaku Kabushiki Kaisha
US Patent
LigandPNGBDBM448262(US10689705, Compound 39)
Affinity DataIC50:  8.30nM. Assay description: The FGFR2 inhibitory activities of compounds listed in Tables 1-1 to 1-5 were measured based on their activity to inhibit phosphorylation of the biot...
Ligand InfoPC cidPC sid
In DepthDetails US Patent