BDBM448415 1-[(6-{5-Azaspiro[2.3]hexan-5-yl}pyridin-3-yl)-::US10695334, Example 104
SMILES Cc1[nH]nc2[C@@H](CCc12)NC(=O)c1cn(Cc2ccc(nc2)N2CC3(CC3)C2)cn1
InChI Key
Data  1 KI  1 IC50
  Tab Delimited (TSV)   2D SDfile   Computed 3D by Vconf -m prep SDfile
Find this compound or compounds like it in BindingDB:
Activity Spreadsheet -- Enzyme Inhibition Constant Data from BindingDB
Found 2 hits for monomerid = 448415
TargetPlasma kallikrein(Homo sapiens (Human))
Boehringer Ingelheim International
US Patent
LigandPNGBDBM448415(1-[(6-{5-Azaspiro[2.3]hexan-5-yl}pyridin-3-yl)- | ...)
Affinity DataKi:  3nM. Assay description: Human PKK (1.78 nM or 0.025 U/mL; Enzyme Research Laboratories) was incubated at 24° C. with 0.25 mM fluorogenic substrate H-Pro-Phe-Arg-AMC (11295 f...
Ligand InfoPC cidPC sid
In DepthDetails US Patent
TargetThymidine kinase, cytosolic(Homo sapiens (Human))
Boehringer Ingelheim International
US Patent
LigandPNGBDBM448415(1-[(6-{5-Azaspiro[2.3]hexan-5-yl}pyridin-3-yl)- | ...)
Affinity DataIC50: >1.00E+4nM. Assay description: Prior to the assay, human TK1 (R&D Systems) was activated by incubation with human trypsin (Calbiochem) in a 1:10,000 ratio for 15 min at 37° C. For ...
Ligand InfoPC cidPC sid
In DepthDetails US Patent