BDBM448423 N-[(6R)-3-Methyl-2H,4H,5H,6H-cyclopenta[c]pyrazol-6-yl]-1-[(2-methyl-6-{2-methyl-3-::US10695334, Example 82
SMILES CC1C2CC2CN1c1ccc(Cn2cc(cn2)C(=O)N[C@@H]2CCc3c(C)[nH]nc23)c(C)n1
InChI Key
Data  1 IC50
  Tab Delimited (TSV)   2D SDfile   Computed 3D by Vconf -m prep SDfile
Find this compound or compounds like it in BindingDB:
Activity Spreadsheet -- Enzyme Inhibition Constant Data from BindingDB
Found 1 hit for monomerid = 448423
TargetThymidine kinase, cytosolic(Homo sapiens (Human))
Boehringer Ingelheim International
US Patent
LigandPNGBDBM448423(N-[(6R)-3-Methyl-2H,4H,5H,6H-cyclopenta[c]pyrazol-...)
Affinity DataIC50: >1.00E+4nM. Assay description: Prior to the assay, human TK1 (R&D Systems) was activated by incubation with human trypsin (Calbiochem) in a 1:10,000 ratio for 15 min at 37° C. For ...
Ligand InfoPC cidPC sid
In DepthDetails US Patent