BDBM448505 US10696638, formula (I) 19
SMILES NCCN(Cc1ccc(F)cc1)C(=S)Nc1ccc2cnccc2c1
InChI Key InChIKey=AVQPQYLTOXBXRM-UHFFFAOYSA-N
Data  1 IC50
  Tab Delimited (TSV)   2D SDfile   Computed 3D by Vconf -m prep SDfile
Find this compound or compounds like it in BindingDB:
Activity Spreadsheet -- Enzyme Inhibition Constant Data from BindingDB
Found 1 hit for monomerid = 448505
TargetRho-associated protein kinase 1(Homo sapiens (Human))
Industrial Technology Research Institute
US Patent
LigandPNGBDBM448505(US10696638, formula (I) 19)
Affinity DataIC50:  550nM. Assay description: ROCK Substrate Coated Plate (Part No 241601): One strip well 96-well plate pre-coated with recombinant MYPT1.Buffer: 25 mM Tris, pH 7.5, 10 mM MgCl2,...
Ligand InfoPC cidPC sid
In DepthDetails US Patent