BDBM448543 7-[7-(difluoromethyl)-6-(1-methylpyrazol-4-yl)-3,4-dihydro-2H-quinolin-1-yl]-N-methyl-1,2,3,5-tetrahydro-1,4-benzodiazepine-4-carboxamide::US10696655, Example 16::US11168070, Example 16
SMILES CNC(=O)N1CCNc2ccc(cc2C1)N1CCCc2cc(-c3cnn(C)c3)c(cc12)C(F)F
InChI Key InChIKey=LRSKPTJETNZLSV-UHFFFAOYSA-N
Data  2 IC50
  Tab Delimited (TSV)   2D SDfile   Computed 3D by Vconf -m prep SDfile
Find this compound or compounds like it in BindingDB:
Activity Spreadsheet -- Enzyme Inhibition Constant Data from BindingDB
Found 2 hits for monomerid = 448543
TargetCREB-binding protein(Homo sapiens (Human))
Genentech
US Patent
LigandPNGBDBM448543(7-[7-(difluoromethyl)-6-(1-methylpyrazol-4-yl)-3,4...)
Affinity DataIC50:  8nM. Assay description: His/Flag epitope tagged CBP was cloned, expressed, and purified to homogeneity. CBP binding and inhibition was assessed by monitoring the engagement ...
Ligand InfoPC cidPC sid
In DepthDetails US Patent
TargetCREB-binding protein(Homo sapiens (Human))
Genentech
US Patent
LigandPNGBDBM448543(7-[7-(difluoromethyl)-6-(1-methylpyrazol-4-yl)-3,4...)
Affinity DataIC50:  8nM. Assay description: His/Flag epitope tagged CBP was cloned, expressed, and purified to homogeneity. CBP binding and inhibition was assessed by monitoring the engagement ...
Ligand InfoPC cidPC sid
In DepthDetails US Patent