BDBM448824 US10696672, Compound 56::US11634418, Compound 56
SMILES OC(=O)[C@H](CCN1CC[C@@H](CCc2ccc3CCCNc3n2)C1)NC(=O)c1cccc(c1)-c1ccccc1
InChI Key InChIKey=BBYMIROXFBEIED-DFHRPNOPSA-N
Data  2 IC50
  Tab Delimited (TSV)   2D SDfile   Computed 3D by Vconf -m prep SDfile
Find this compound or compounds like it in BindingDB:
Activity Spreadsheet -- Enzyme Inhibition Constant Data from BindingDB
Found 2 hits for monomerid = 448824
TargetIntegrin alpha-V/beta-6(Homo sapiens (Human))
Pliant Therapeutics
US Patent
LigandPNGBDBM448824(US10696672, Compound 56 | US11634418, Compound 56)
Affinity DataIC50: <50nM. Assay description: Microplates were coated with recombinant human integrin αvβ6 (2 ug/ml) in PBS (100 ul/well 25° C. overnight). The coating solution was remo...
Ligand InfoPC cidPC sid
In DepthDetails US Patent
TargetIntegrin alpha-V/beta-6(Homo sapiens (Human))
Pliant Therapeutics
US Patent
LigandPNGBDBM448824(US10696672, Compound 56 | US11634418, Compound 56)
Affinity DataIC50: <50nM. Assay description: Microplates were coated with recombinant human integrin αvβ6 (2 ug/ml) in PBS (100 ul/well 25° C., overnight). The coating solution was rem...
Ligand InfoPC cidPC sid
In DepthDetails US Patent