BDBM448925 US10696682, Compound 36
SMILES CC(C)CN1CCN(CC1)c1ccc(NC2=NC3C(C=C4N3C3(CCCC3)CNC4=O)C=N2)nc1
InChI Key InChIKey=UNIAVPLSPLAACV-UHFFFAOYSA-N
Data  1 IC50
  Tab Delimited (TSV)   2D SDfile   Computed 3D by Vconf -m prep SDfile
Find this compound or compounds like it in BindingDB:
Activity Spreadsheet -- Enzyme Inhibition Constant Data from BindingDB
Found 1 hit for monomerid = 448925
TargetCyclin-dependent kinase 2/G1/S-specific cyclin-E1(Homo sapiens (Human))
G1 Therapeutics
US Patent
LigandPNGBDBM448925(US10696682, Compound 36)
Affinity DataIC50:  5.05E+4nM. Assay description: Kinase enzymatic reactions were performed in 384-well microplates using a 12-channel Caliper LabChip instrument as a detection device. The enzymatic ...
Ligand InfoPC cidPC sid
In DepthDetails US Patent