BDBM448936 5-Fluoro-4-(5-fluoro-1,1-dimethyl-2,3-dihydro-1H-benzo[d]pyrrolo[1,2-a]imidazol-7-yl)-N-(6-m ethyl-5-(piperidine-1-yl)pyridin-2-yl)pyrimidin-2-amine::US10696678, Example 31
SMILES Cc1nc(Nc2ncc(F)c(n2)-c2cc(F)c3nc4CCC(C)(C)n4c3c2)ccc1N1CCNCC1
InChI Key InChIKey=JWCQAQWFNKETOS-UHFFFAOYSA-N
Data  3 IC50
  Tab Delimited (TSV)   2D SDfile   Computed 3D by Vconf -m prep SDfile
Find this compound or compounds like it in BindingDB:
Activity Spreadsheet -- Enzyme Inhibition Constant Data from BindingDB
Found 3 hits for monomerid = 448936
TargetCyclin-dependent kinase 4/G1/S-specific cyclin-D3(Homo sapiens (Human))
Gan & Lee Pharmaceuticals
US Patent
LigandPNGBDBM448936(5-Fluoro-4-(5-fluoro-1,1-dimethyl-2,3-dihydro-1H-b...)
Affinity DataIC50:  2.00E+3nM. Assay description: In vitro inhibition of CDK (CDK1, CDK4, CDK6) activity by compounds of the present invention was tested by the following method.1. Preparation of kin...
Ligand InfoPC cidPC sid
In DepthDetails US Patent
TargetCyclin-A2/Cyclin-dependent kinase 1(Homo sapiens (Human))
Gan & Lee Pharmaceuticals
US Patent
LigandPNGBDBM448936(5-Fluoro-4-(5-fluoro-1,1-dimethyl-2,3-dihydro-1H-b...)
Affinity DataIC50:  351nM. Assay description: In vitro inhibition of CDK (CDK1, CDK4, CDK6) activity by compounds of the present invention was tested by the following method.1. Preparation of kin...
Ligand InfoPC cidPC sid
In DepthDetails US Patent
TargetCyclin-dependent kinase 6/G1/S-specific cyclin-D3(Homo sapiens (Human))
Gan & Lee Pharmaceuticals
US Patent
LigandPNGBDBM448936(5-Fluoro-4-(5-fluoro-1,1-dimethyl-2,3-dihydro-1H-b...)
Affinity DataIC50:  5.50E+4nM. Assay description: In vitro inhibition of CDK (CDK1, CDK4, CDK6) activity by compounds of the present invention was tested by the following method.1. Preparation of kin...
Ligand InfoPC cidPC sid
In DepthDetails US Patent