BDBM448974 N-(5-(1-Ethylpiperidine-4-yl)pyridin-2-yl)-5-fluoro-4-(5-fluoro-1-methyl-2,3-dihydro-1H-benzo[d]pyrrolo[1,2-a]imidazol-7-yl)pyrimidin-2-amine::US10696678, Example 69
SMILES CCN1CCC(CC1)c1ccc(Nc2ncc(F)c(n2)-c2cc(F)c3nc4CCC(C)n4c3c2)nc1
InChI Key InChIKey=JXVNZQMUNCYZPO-UHFFFAOYSA-N
Data  2 IC50
  Tab Delimited (TSV)   2D SDfile   Computed 3D by Vconf -m prep SDfile
Find this compound or compounds like it in BindingDB:
Activity Spreadsheet -- Enzyme Inhibition Constant Data from BindingDB
Found 2 hits for monomerid = 448974
TargetCyclin-dependent kinase 6/G1/S-specific cyclin-D3(Homo sapiens (Human))
Gan & Lee Pharmaceuticals
US Patent
LigandPNGBDBM448974(N-(5-(1-Ethylpiperidine-4-yl)pyridin-2-yl)-5-fluor...)
Affinity DataIC50:  2.44E+4nM. Assay description: In vitro inhibition of CDK (CDK1, CDK4, CDK6) activity by compounds of the present invention was tested by the following method.1. Preparation of kin...
Ligand InfoPC cidPC sid
In DepthDetails US Patent
TargetCyclin-dependent kinase 4/G1/S-specific cyclin-D3(Homo sapiens (Human))
Gan & Lee Pharmaceuticals
US Patent
LigandPNGBDBM448974(N-(5-(1-Ethylpiperidine-4-yl)pyridin-2-yl)-5-fluor...)
Affinity DataIC50:  4.00E+4nM. Assay description: In vitro inhibition of CDK (CDK1, CDK4, CDK6) activity by compounds of the present invention was tested by the following method.1. Preparation of kin...
Ligand InfoPC cidPC sid
In DepthDetails US Patent