BDBM448990 US10696682, Compound 6
SMILES CC(C)C1CN(C)C(=O)C2=CC3C=NC(Nc4ccc(cn4)N4CCN(CC4)C(=O)OC(C)(C)C)=NC3N12
InChI Key InChIKey=DUYAGDRDJPVOKA-UHFFFAOYSA-N
Data  1 IC50
  Tab Delimited (TSV)   2D SDfile   Computed 3D by Vconf -m prep SDfile
Find this compound or compounds like it in BindingDB:
Activity Spreadsheet -- Enzyme Inhibition Constant Data from BindingDB
Found 1 hit for monomerid = 448990
TargetCyclin-dependent kinase 2/G1/S-specific cyclin-E1(Homo sapiens (Human))
G1 Therapeutics
US Patent
LigandPNGBDBM448990(US10696682, Compound 6)
Affinity DataIC50: >1.00E+5nM. Assay description: Kinase enzymatic reactions were performed in 384-well microplates using a 12-channel Caliper LabChip instrument as a detection device. The enzymatic ...
Ligand InfoPC cidPC sid
In DepthDetails US Patent