BDBM449022 US10696689, Compound 3-19
SMILES Nc1ncc(-c2cc(F)cc(F)c2)c(N2CCC3NCCOC3C2)c1-c1nc2c(F)cc(cc2[nH]1)C#N
InChI Key
Data  1 EC50
  Tab Delimited (TSV)   2D SDfile   Computed 3D by Vconf -m prep SDfile
Find this compound or compounds like it in BindingDB:
Activity Spreadsheet -- Enzyme Inhibition Constant Data from BindingDB
Found 1 hit for monomerid = 449022
TargetSomatostatin receptor type 2(Homo sapiens (Human))
Crinetics Pharmaceuticals
US Patent
LigandPNGBDBM449022(US10696689, Compound 3-19)
Affinity DataEC50:  0.550nM. Assay description: On the day of the assay, the media is aspirated and the cells are treated with 50 μL of 1.6 μM NKH477 (Sigma # N3290) plus various dilution...
Ligand InfoPC cidPC sid
In DepthDetails US Patent