BDBM449220 US10702504, Compound I-A2
SMILES COc1ccc(cc1OC)S(=O)(=O)Nc1cc2n(C)c(=O)n(C)c2cc1Oc1ccc(OCC(=O)NCCCCCCCCNC(=O)COc2cccc3C(=O)N(C4CCC(=O)NC4=O)C(=O)c23)cc1
InChI Key InChIKey=LHKJSNLKJBPFNE-UHFFFAOYSA-N
Data  1 IC50
  Tab Delimited (TSV)   2D SDfile   Computed 3D by Vconf -m prep SDfile
Find this compound or compounds like it in BindingDB:
Activity Spreadsheet -- Enzyme Inhibition Constant Data from BindingDB
Found 1 hit for monomerid = 449220
TargetTranscription intermediary factor 1-alpha(Homo sapiens (Human))
Dana-Farber Cancer Institute
US Patent
LigandPNGBDBM449220(US10702504, Compound I-A2)
Affinity DataIC50:  750nM. Assay description: The alpha assay was used to assess the binding of the compounds of the application to TRIM24 at various concentrations. All compounds were added at c...
Ligand InfoPC cidPC sid
In DepthDetails US Patent