BDBM449552 US10703733, Example 165::US10988451, Example 165::US11643400, Example 165
SMILES CO[C@H]1\C=C\C[C@H](C)C[S@@](=O)(NC(=O)[C@H]2C[C@@](C)(O)C2)=NC(=O)c2ccc3OC[C@]4(CCCc5cc(Cl)ccc45)CN(C[C@@H]4CC[C@@H]14)c3c2
InChI Key InChIKey=PJAJIZKFORNYGD-BMGLQOSOSA-N
Data  3 IC50
  Tab Delimited (TSV)   2D SDfile   Computed 3D by Vconf -m prep SDfile
Find this compound or compounds like it in BindingDB:
Activity Spreadsheet -- Enzyme Inhibition Constant Data from BindingDB
Found 3 hits for monomerid = 449552
LigandPNGBDBM449552(US10703733, Example 165 | US10988451, Example 165 ...)
Affinity DataIC50:  0.0350nM. Assay description: The AlphaLISA assay was performed in a 384-well Proxiplate in a total volume of 40 μL. The reaction mixture contained 0.0625 nM 6×His-Mcl-1 (171...
Ligand InfoPC cidPC sid
In DepthDetails US Patent
LigandPNGBDBM449552(US10703733, Example 165 | US10988451, Example 165 ...)
Affinity DataIC50:  0.0350nM. Assay description: The AlphaLISA assay was performed in a 384-well Proxiplate in a total volume of 40 μL. The reaction mixture contained 0.0625 nM 6×His-Mcl-1 (171...
Ligand InfoPC cidPC sid
In DepthDetails US Patent
TargetInduced myeloid leukemia cell differentiation protein Mcl-1 [171-327](Homo sapiens (Human))
Gilead Sciences
US Patent
LigandPNGBDBM449552(US10703733, Example 165 | US10988451, Example 165 ...)
Affinity DataIC50:  0.0350nM. Assay description: The AlphaLISA assay was performed in a 384-well Proxiplate in a total volume of 40 μL. The reaction mixture contained 0.0625 nM 6× His-Mcl-1 (17...
Ligand InfoPC cidPC sid
In DepthDetails US Patent