BDBM450122 US10703755, Example 305
SMILES COc1nc(C)c2nc(-c3cncc(C)c3)n(Cc3ccc(cc3F)C3CN4CCC3CC4)c2n1
InChI Key InChIKey=GHLHUZVVQZZNAU-UHFFFAOYSA-N
Data  1 IC50
  Tab Delimited (TSV)   2D SDfile   Computed 3D by Vconf -m prep SDfile
Find this compound or compounds like it in BindingDB:
Activity Spreadsheet -- Enzyme Inhibition Constant Data from BindingDB
Found 1 hit for monomerid = 450122
TargetToll-like receptor 7(Homo sapiens (Human))
Sumitomo Dainippon Pharma
US Patent
LigandPNGBDBM450122(US10703755, Example 305)
Affinity DataIC50:  5nM. Assay description: As human TLR7 expressing cell line, HEK293 cell line was bought from IMGENEX Corporation (TLR7/NF-ηB/SEAPorter™ HEK293 cell), which is human emb...
Ligand InfoPC cidPC sid
In DepthDetails US Patent