BDBM450278 US10676431, Example 41::US11117861, Example 41
SMILES OCc1ccccc1-c1ccc(N2CC[C@@H](NC(=O)Nc3ccc(cc3)C(F)(F)F)C2=O)c(F)c1F
InChI Key InChIKey=QPKPARJAVTWOJA-LJQANCHMSA-N
Data  4 EC50
  Tab Delimited (TSV)   2D SDfile   Computed 3D by Vconf -m prep SDfile
Find this compound or compounds like it in BindingDB:
Activity Spreadsheet -- Enzyme Inhibition Constant Data from BindingDB
Found 4 hits for monomerid = 450278
TargetN-formyl peptide receptor 2(Homo sapiens (Human))
Bristol-Myers Squibb
US Patent
LigandPNGBDBM450278(US10676431, Example 41 | US11117861, Example 41)
Affinity DataEC50:  3.60nM. Assay description: A mixture of forskolin (5 μM final for FPR2 or 10 μM final for FPR1) and IBMX (200 μM final) were added to 384-well Proxiplates (Perki...
Ligand InfoPC cidPC sid
In DepthDetails US Patent
TargetfMet-Leu-Phe receptor(Homo sapiens (Human))
Bristol-Myers Squibb
US Patent
LigandPNGBDBM450278(US10676431, Example 41 | US11117861, Example 41)
Affinity DataEC50:  500nM. Assay description: FPR2 and FPR1 Cyclic Adenosine Monophosphate (cAMP) Assays. A mixture of forskolin (5 μM final for FPR2 or 10 μM final for FPR1) and IBMX (...
Ligand InfoPC cidPC sid
In DepthDetails US Patent
TargetN-formyl peptide receptor 2(Homo sapiens (Human))
Bristol-Myers Squibb
US Patent
LigandPNGBDBM450278(US10676431, Example 41 | US11117861, Example 41)
Affinity DataEC50:  3.60nM. Assay description: FPR2 and FPR1 Cyclic Adenosine Monophosphate (cAMP) Assays. A mixture of forskolin (5 μM final for FPR2 or 10 μM final for FPR1) and IBMX (...
Ligand InfoPC cidPC sid
In DepthDetails US Patent
TargetfMet-Leu-Phe receptor(Homo sapiens (Human))
Bristol-Myers Squibb
US Patent
LigandPNGBDBM450278(US10676431, Example 41 | US11117861, Example 41)
Affinity DataEC50:  500nM. Assay description: A mixture of forskolin (5 μM final for FPR2 or 10 μM final for FPR1) and IBMX (200 μM final) were added to 384-well Proxiplates (Perki...
Ligand InfoPC cidPC sid
In DepthDetails US Patent