BDBM450283 US10676431, Example 46::US11117861, Example 46
SMILES CP(C)(=O)c1ccccc1-c1ccc(N2CC[C@@H](NC(=O)Nc3ccc(Cl)cc3F)C2=O)c(c1)C1CC1
InChI Key InChIKey=IRNKZPKJQPFFNB-XMMPIXPASA-N
Data  4 EC50
  Tab Delimited (TSV)   2D SDfile   Computed 3D by Vconf -m prep SDfile
Find this compound or compounds like it in BindingDB:
Activity Spreadsheet -- Enzyme Inhibition Constant Data from BindingDB
Found 4 hits for monomerid = 450283
TargetN-formyl peptide receptor 2(Homo sapiens (Human))
Bristol-Myers Squibb
US Patent
LigandPNGBDBM450283(US10676431, Example 46 | US11117861, Example 46)
Affinity DataEC50:  4.80nM. Assay description: A mixture of forskolin (5 μM final for FPR2 or 10 μM final for FPR1) and IBMX (200 μM final) were added to 384-well Proxiplates (Perki...
Ligand InfoPC cidPC sid
In DepthDetails US Patent
TargetfMet-Leu-Phe receptor(Homo sapiens (Human))
Bristol-Myers Squibb
US Patent
LigandPNGBDBM450283(US10676431, Example 46 | US11117861, Example 46)
Affinity DataEC50:  93nM. Assay description: FPR2 and FPR1 Cyclic Adenosine Monophosphate (cAMP) Assays. A mixture of forskolin (5 μM final for FPR2 or 10 μM final for FPR1) and IBMX (...
Ligand InfoPC cidPC sid
In DepthDetails US Patent
TargetN-formyl peptide receptor 2(Homo sapiens (Human))
Bristol-Myers Squibb
US Patent
LigandPNGBDBM450283(US10676431, Example 46 | US11117861, Example 46)
Affinity DataEC50:  4.80nM. Assay description: FPR2 and FPR1 Cyclic Adenosine Monophosphate (cAMP) Assays. A mixture of forskolin (5 μM final for FPR2 or 10 μM final for FPR1) and IBMX (...
Ligand InfoPC cidPC sid
In DepthDetails US Patent
TargetfMet-Leu-Phe receptor(Homo sapiens (Human))
Bristol-Myers Squibb
US Patent
LigandPNGBDBM450283(US10676431, Example 46 | US11117861, Example 46)
Affinity DataEC50:  93nM. Assay description: A mixture of forskolin (5 μM final for FPR2 or 10 μM final for FPR1) and IBMX (200 μM final) were added to 384-well Proxiplates (Perki...
Ligand InfoPC cidPC sid
In DepthDetails US Patent