BDBM450665 1-(2-methoxyethyl)-2-({4-[2-methyl-2-(6- methylpyridin-3-yl)-1,3-benzodioxol-4- yl]piperidin-1-yl}methyl)-1H- benzimidazole-6-carboxylic acid, formate salt::US10676465, Example 42
SMILES COCCn1c(CN2CCC(CC2)c2cccc3OC(C)(Oc23)c2ccc(C)nc2)nc2ccc(cc12)C(O)=O
InChI Key InChIKey=SBKGCYMQXFXCMN-UHFFFAOYSA-N
Data  2 EC50
  Tab Delimited (TSV)   2D SDfile   Computed 3D by Vconf -m prep SDfile
Find this compound or compounds like it in BindingDB:
Activity Spreadsheet -- Enzyme Inhibition Constant Data from BindingDB
Found 2 hits for monomerid = 450665
TargetGlucagon-like peptide 1 receptor(Homo sapiens (Human))
Pfizer
US Patent
LigandPNGBDBM450665(1-(2-methoxyethyl)-2-({4-[2-methyl-2-(6- methylpyr...)
Affinity DataEC50:  1.70E+3nM. Assay description: GLP-1R-mediated agonist activity was determined with a cell-based functional assay utilizing an HTRF (Homogeneous Time-Resolved Fluorescence) cAMP de...
Ligand InfoPC cidPC sid
In DepthDetails US Patent
TargetGlucagon-like peptide 1 receptor(Homo sapiens (Human))
Pfizer
US Patent
LigandPNGBDBM450665(1-(2-methoxyethyl)-2-({4-[2-methyl-2-(6- methylpyr...)
Affinity DataEC50:  120nM. Assay description: GLP-1R-mediated agonist activity was determined with a cell-based functional assay utilizing an HTRF (Homogeneous Time-Resolved Fluorescence) cAMP de...
Ligand InfoPC cidPC sid
In DepthDetails US Patent