BDBM450764 US10676467, Compound TZ 43 83
SMILES NC1CCN(Cc2ccc(cc2)-c2noc(n2)-c2ccc(OCCF)c(c2)C(F)(F)F)CC1
InChI Key InChIKey=XKYOUBWALNOOED-UHFFFAOYSA-N
Data  1 IC50
  Tab Delimited (TSV)   2D SDfile   Computed 3D by Vconf -m prep SDfile
Find this compound or compounds like it in BindingDB:
Activity Spreadsheet -- Enzyme Inhibition Constant Data from BindingDB
Found 1 hit for monomerid = 450764
TargetSphingosine 1-phosphate receptor 1(Homo sapiens (Human))
Washington University
US Patent
LigandPNGBDBM450764(US10676467, Compound TZ 43 83)
Affinity DataIC50:  156nM. Assay description: Newly synthesized compounds were first evaluated for binding potency toward S1P1 by a [32P]S1P competitive binding assay following published procedur...
Ligand InfoPC cidPC sid
In DepthDetails US Patent