BDBM450886 US10676469, Compound 157::US11124504, Cpd. No. 157
SMILES CCc1cc2c(C)c(-c3nc(C)no3)c(nc2c(F)c1F)N1CCC(CC1)N[C@H]1CCCOC1
InChI Key InChIKey=RZBYXXRYLZQFED-SFHVURJKSA-N
Data  4 IC50
  Tab Delimited (TSV)   2D SDfile   Computed 3D by Vconf -m prep SDfile
Find this compound or compounds like it in BindingDB:
Activity Spreadsheet -- Enzyme Inhibition Constant Data from BindingDB
Found 2 hits for monomerid = 450886
TargetMu-type opioid receptor(Homo sapiens (Human))
Blackthorn Therapeutics
US Patent
LigandPNGBDBM450886(US10676469, Compound 157 | US11124504, Cpd. No. 15...)
Affinity DataIC50: >100nM. Assay description: The purpose of this assay is to confirm the potency and selectivity of compounds synthesized to be OPRK1 Antagonists. This assay monitors the OPRMu1 ...
Ligand InfoPC cidPC sid
In DepthDetails US Patent
TargetKappa-type opioid receptor(Homo sapiens (Human))
Blackthorn Therapeutics
US Patent
LigandPNGBDBM450886(US10676469, Compound 157 | US11124504, Cpd. No. 15...)
Affinity DataIC50: <1nM. Assay description: The cell line for the OPRK1 antagonist assay stably expresses the following elements: The carboxy terminus of the OPRK1 receptor has a 7-amino acid l...
Ligand InfoPC cidPC sid
In DepthDetails US Patent