BDBM451096 US10676485, Example 6
SMILES CN1CCN(C[C@@H]2COc3ccc(OCc4ccnc(n4)-c4ccc(OC[C@@H]5COCCO5)nc4)c(C[C@@H](Oc4ncnc5sc(c(-c6c(C)c(Cl)c(O2)c(Cl)c6C)c45)-c2ccc(F)cc2)C(O)=O)c3)CC1
InChI Key InChIKey=XHQYRZGRMKDIPS-FCHQCLMOSA-N
Data  2 KI
  Tab Delimited (TSV)   2D SDfile   Computed 3D by Vconf -m prep SDfile
Find this compound or compounds like it in BindingDB:
Activity Spreadsheet -- Enzyme Inhibition Constant Data from BindingDB
Found 2 hits for monomerid = 451096
TargetInduced myeloid leukemia cell differentiation protein Mcl-1(Homo sapiens (Human))
Abbvie
US Patent
LigandPNGBDBM451096(US10676485, Example 6)
Affinity DataKi:  0.926nM. Assay description: The ability of the exemplary MCL-1 inhibitors of Examples 1 through 151 to bind MCL-1 was demonstrated using the Time Resolved-Fluorescence Resonance...
Ligand InfoPC cidPC sid
In DepthDetails US Patent
TargetInduced myeloid leukemia cell differentiation protein Mcl-1(Homo sapiens (Human))
Abbvie
US Patent
LigandPNGBDBM451096(US10676485, Example 6)
Affinity DataKi:  6.09nM. Assay description: The ability of the exemplary MCL-1 inhibitors of Examples 1 through 151 to bind MCL-1 was demonstrated using the Time Resolved-Fluorescence Resonance...
Ligand InfoPC cidPC sid
In DepthDetails US Patent