BDBM45279 2-[(4-morpholin-4-yl-1,2,5-thiadiazol-3-yl)oxy]-N'-[(E)-(6-oxidanylidenecyclohexa-2,4-dien-1-ylidene)methyl]ethanehydrazide::2-[(4-morpholin-4-yl-1,2,5-thiadiazol-3-yl)oxy]-N'-[(E)-(6-oxocyclohexa-2,4-dien-1-ylidene)methyl]acetohydrazide::2-[[4-(4-morpholinyl)-1,2,5-thiadiazol-3-yl]oxy]-N'-[(E)-(6-oxo-1-cyclohexa-2,4-dienylidene)methyl]acetohydrazide::MLS000705462::N'-(2-hydroxybenzylidene)-2-{[4-(4-morpholinyl)-1,2,5-thiadiazol-3-yl]oxy}acetohydrazide::N'-[(E)-(6-ketocyclohexa-2,4-dien-1-ylidene)methyl]-2-[(4-morpholino-1,2,5-thiadiazol-3-yl)oxy]acetohydrazide::SMR000230516::cid_6504434
SMILES Oc1ccccc1C=NNC(=O)COc1nsnc1N1CCOCC1
InChI Key InChIKey=BKJDYWYOGUGVSR-UHFFFAOYSA-N
Data  1 EC50
  Tab Delimited (TSV)   2D SDfile   Computed 3D by Vconf -m prep SDfile
Find this compound or compounds like it in BindingDB:
Activity Spreadsheet -- Enzyme Inhibition Constant Data from BindingDB
Found 1 hit for monomerid = 45279
TargetMultidrug resistance-associated protein 1(Homo sapiens (Human))
Srmlsc
Curated by PubChem BioAssay
LigandPNGBDBM45279(2-[(4-morpholin-4-yl-1,2,5-thiadiazol-3-yl)oxy]-N'...)
Affinity DataEC50:  1.39E+3nM. Assay description: Southern Research Molecular Libraries Screening Center (SRMLSC) Southern Research Institute (Birmingham, Alabama) NIH Molecular Libraries Screening C...
In DepthDetails PCBioAssay