BDBM454927 US10730870, Example 94::US11512083, Example 94
SMILES CC[C@H](C)[C@H](N1Cc2ccc(F)cc2C1=O)C(=O)N1C[C@H](O)C[C@H]1C(=O)NCc1ccc(cc1)-c1scnc1C
InChI Key InChIKey=BADMTEFLTGIPRJ-NMCMYWIVSA-N
Data  2 IC50
  Tab Delimited (TSV)   2D SDfile   Computed 3D by Vconf -m prep SDfile
Find this compound or compounds like it in BindingDB:
Activity Spreadsheet -- Enzyme Inhibition Constant Data from BindingDB
Found 2 hits for monomerid = 454927
TargetVHL complex(Homo sapiens (Human))
Arvinas Operations
US Patent
LigandPNGBDBM454927(US10730870, Example 94 | US11512083, Example 94)
Affinity DataIC50:  566nM. Assay description: Ability of VHL ligands to compete for the HIF 1 a binding site on VCB was determined through a fluorescence polarization competition assay as describ...
Ligand InfoKEGGPC cidPC sid
In DepthDetails US Patent
Targetvon Hippel-Lindau disease tumor suppressor(Homo sapiens (Human))
Arvinas Operations
US Patent
LigandPNGBDBM454927(US10730870, Example 94 | US11512083, Example 94)
Affinity DataIC50:  566nM. Assay description: Ability of VHL ligands to compete for the HIF 1 a binding site on VCB was determined through a fluorescence polarization competition assay as describ...
Ligand InfoKEGGPC cidPC sid
In DepthDetails US Patent