BDBM455342 7-(3,4-Difluorophenyl)-N4,5,5-trimethyl-N2-((1R,5S,8s)-3-(5-methyl-1,3,4-oxadiazol-2-yl)-3-azabicyclo[3.2.1]octan-8-yl)-6,7-dihydro-5H-pyrrolo[2,3-d]pyrimidine-2,4-diamine::US10730881, Example 8
SMILES CNc1nc(NC2C3CCC2CN(C3)c2nnc(C)o2)nc2N(CC(C)(C)c12)c1ccc(F)c(F)c1
InChI Key InChIKey=BJHYUOZZUHYNGD-UHFFFAOYSA-N
Data  1 EC50
  Tab Delimited (TSV)   2D SDfile   Computed 3D by Vconf -m prep SDfile
Find this compound or compounds like it in BindingDB:
Activity Spreadsheet -- Enzyme Inhibition Constant Data from BindingDB
Found 1 hit for monomerid = 455342
TargetAmyloid-beta precursor protein(Homo sapiens (Human))
Hoffmann-La Roche
US Patent
LigandPNGBDBM455342(7-(3,4-Difluorophenyl)-N4,5,5-trimethyl-N2-((1R,5S...)
Affinity DataEC50:  33nM. Assay description: Human neuroglioma H4 cells overexpressing human APP695 with the Swedish double mutation (K595N/M596L) were plated at 30,000 cells/well/100 μl in...
Ligand InfoPC cidPC sid
In DepthDetails US Patent