BDBM455359 (S)- or (R)-7-(4-Fluorophenyl)-N4,5-dimethyl-N2-((1R,5S,8s)-3-(6-methylpyrimidin-4-yl)-3-azabicyclo[3.2.1]octan-8-yl)-6,7-dihydro-5H-pyrrolo[2,3-d]pyrimidine-2,4-diamine::US10730881, Example 25p
SMILES C[C@@H]1CN(c2nc(NC3C4CCC3CN(C4)c3cc(C)ncn3)nc(Cl)c12)c1ccc(F)cc1
InChI Key InChIKey=FRKSQWAXINDDAR-XHZFVRRNSA-N
Data  1 EC50
  Tab Delimited (TSV)   2D SDfile   Computed 3D by Vconf -m prep SDfile
Find this compound or compounds like it in BindingDB:
Activity Spreadsheet -- Enzyme Inhibition Constant Data from BindingDB
Found 1 hit for monomerid = 455359
TargetAmyloid-beta precursor protein(Homo sapiens (Human))
Hoffmann-La Roche
US Patent
LigandPNGBDBM455359((S)- or (R)-7-(4-Fluorophenyl)-N4,5-dimethyl-N2-((...)
Affinity DataEC50:  16nM. Assay description: Human neuroglioma H4 cells overexpressing human APP695 with the Swedish double mutation (K595N/M596L) were plated at 30,000 cells/well/100 μl in...
Ligand InfoPC cidPC sid
In DepthDetails US Patent