BDBM456688 US10736883, Example 143.0
SMILES CO[C@@H]([C@H](C)S(=O)(=O)Nc1nnc(-c2ccc(C)o2)n1-c1c(OC)cccc1OC)c1ccc(cc1C#N)C#N
InChI Key InChIKey=VGURITIZYFDDOV-GKVSMKOHSA-N
Data  1 EC50
  Tab Delimited (TSV)   2D SDfile   Computed 3D by Vconf -m prep SDfile
Find this compound or compounds like it in BindingDB:
Activity Spreadsheet -- Enzyme Inhibition Constant Data from BindingDB
Found 1 hit for monomerid = 456688
TargetApelin receptor(Homo sapiens (Human))
Amgen
US Patent
LigandPNGBDBM456688(US10736883, Example 143.0)
Affinity DataEC50:  0.0720nM. Assay description: The human APJ receptor was cloned by polymerase chain reaction and the gene encoding the receptor was subcloned in pFLAG-CMV-3 expression vector (Sig...
Ligand InfoPC cidPC sid
In DepthDetails US Patent