BDBM456690 US10736883, Example 145.0
SMILES COc1cccc(OC)c1-n1c(NS(=O)(=O)C[C@H](O)c2ccc(Cl)cc2S(C)(=O)=O)nnc1-c1ccc(C)o1
InChI Key InChIKey=VCZHIUKGHJLALR-KRWDZBQOSA-N
Data  1 EC50
  Tab Delimited (TSV)   2D SDfile   Computed 3D by Vconf -m prep SDfile
Find this compound or compounds like it in BindingDB:
Activity Spreadsheet -- Enzyme Inhibition Constant Data from BindingDB
Found 1 hit for monomerid = 456690
TargetApelin receptor(Homo sapiens (Human))
Amgen
US Patent
LigandPNGBDBM456690(US10736883, Example 145.0)
Affinity DataEC50:  0.0900nM. Assay description: The human APJ receptor was cloned by polymerase chain reaction and the gene encoding the receptor was subcloned in pFLAG-CMV-3 expression vector (Sig...
Ligand InfoPC cidPC sid
In DepthDetails US Patent