BDBM456785 US10736883, Example 262.0
SMILES COc1cccc(OC)c1-n1c(NS(=O)(=O)[C@@H](C)[C@H](C)c2ncc(C)cn2)nnc1-c1ccc(C)o1
InChI Key InChIKey=LVVSGKQNNGIYRN-IRXDYDNUSA-N
Data  1 EC50
  Tab Delimited (TSV)   2D SDfile   Computed 3D by Vconf -m prep SDfile
Find this compound or compounds like it in BindingDB:
Activity Spreadsheet -- Enzyme Inhibition Constant Data from BindingDB
Found 1 hit for monomerid = 456785
TargetApelin receptor(Homo sapiens (Human))
Amgen
US Patent
LigandPNGBDBM456785(US10736883, Example 262.0)
Affinity DataEC50:  0.0700nM. Assay description: The human APJ receptor was cloned by polymerase chain reaction and the gene encoding the receptor was subcloned in pFLAG-CMV-3 expression vector (Sig...
Ligand InfoPC cidPC sid
In DepthDetails US Patent