BDBM456786 US10736883, Example 263.0
SMILES CO[C@@H]([C@H](C)S(=O)(=O)Nc1nnc(-c2ccc(C)o2)n1-c1c(OC)cccc1OC)c1cn2ccccc2n1
InChI Key InChIKey=NSLQEPXBWMJUSU-XDHUDOTRSA-N
Data  1 EC50
  Tab Delimited (TSV)   2D SDfile   Computed 3D by Vconf -m prep SDfile
Find this compound or compounds like it in BindingDB:
Activity Spreadsheet -- Enzyme Inhibition Constant Data from BindingDB
Found 1 hit for monomerid = 456786
TargetApelin receptor(Homo sapiens (Human))
Amgen
US Patent
LigandPNGBDBM456786(US10736883, Example 263.0)
Affinity DataEC50:  0.0860nM. Assay description: The human APJ receptor was cloned by polymerase chain reaction and the gene encoding the receptor was subcloned in pFLAG-CMV-3 expression vector (Sig...
Ligand InfoPC cidPC sid
In DepthDetails US Patent