BDBM45696 (6,6-Dimethyl-2-methylsulfanyl-5,8-dihydro-6H-pyrano[4',3':4,5]thieno[2,3-d]pyrimidin-4-ylsulfanyl)-aceti c acid::2-[(6,6-dimethyl-2-methylsulfanyl-5,8-dihydropyrano[2,3]thieno[2,4-b]pyrimidin-4-yl)sulfanyl]acetic acid::2-[(6,6-dimethyl-2-methylsulfanyl-5,8-dihydropyrano[2,3]thieno[2,4-b]pyrimidin-4-yl)sulfanyl]ethanoic acid::2-[[6,6-dimethyl-2-(methylthio)-5,8-dihydropyrano[2,3]thieno[2,4-b]pyrimidin-4-yl]thio]acetic acid::MLS000778209::SMR000414967::cid_1868051
SMILES CSc1nc(SCC(O)=O)c2c3CC(C)(C)OCc3sc2n1
InChI Key InChIKey=IXXWYVBNIBPYDS-UHFFFAOYSA-N
Data  5 IC50
  Tab Delimited (TSV)   2D SDfile   Computed 3D by Vconf -m prep SDfile
Find this compound or compounds like it in BindingDB:
Activity Spreadsheet -- Enzyme Inhibition Constant Data from BindingDB
Found 5 hits for monomerid = 45696
TargetCoagulation factor XII(Homo sapiens (Human))
Pcmd
Curated by PubChem BioAssay
LigandPNGBDBM45696((6,6-Dimethyl-2-methylsulfanyl-5,8-dihydro-6H-pyra...)
Affinity DataIC50: >5.00E+4nM. Assay description: Molecular Library Screening Center Network (MLSCN) Penn Center for Molecular Discovery (PCMD) Assay Provider: Scott L. Diamond, University of Pennsy...
In DepthDetails PCBioAssay
TargetBeta-lactamase(Pseudomonas aeruginosa)
The Scripps Research Institute Molecular Screening Center
Curated by PubChem BioAssay
LigandPNGBDBM45696((6,6-Dimethyl-2-methylsulfanyl-5,8-dihydro-6H-pyra...)
Affinity DataIC50:  2.97E+4nM. Assay description: Source (MLPCN Center Name): The Scripps Research Institute Molecular Screening Center (SRIMSC) Center Affiliation: The Scripps Research Institute (TS...
In DepthDetails PCBioAssay
TargetBeta-lactamase(Pseudomonas aeruginosa)
The Scripps Research Institute Molecular Screening Center
Curated by PubChem BioAssay
LigandPNGBDBM45696((6,6-Dimethyl-2-methylsulfanyl-5,8-dihydro-6H-pyra...)
Affinity DataIC50:  5.96E+4nM. Assay description: Source (MLPCN Center Name): The Scripps Research Institute Molecular Screening Center (SRIMSC) Center Affiliation: The Scripps Research Institute (TS...
In DepthDetails PCBioAssay
TargetBeta-lactamase(Pseudomonas aeruginosa)
The Scripps Research Institute Molecular Screening Center
Curated by PubChem BioAssay
LigandPNGBDBM45696((6,6-Dimethyl-2-methylsulfanyl-5,8-dihydro-6H-pyra...)
Affinity DataIC50:  5.35E+3nM. Assay description: Source (MLPCN Center Name): The Scripps Research Institute Molecular Screening Center (SRIMSC) Center Affiliation: The Scripps Research Institute (TS...
In DepthDetails PCBioAssay
TargetBeta-lactamase(Pseudomonas aeruginosa)
The Scripps Research Institute Molecular Screening Center
Curated by PubChem BioAssay
LigandPNGBDBM45696((6,6-Dimethyl-2-methylsulfanyl-5,8-dihydro-6H-pyra...)
Affinity DataIC50:  5.96E+4nM. Assay description: Source (MLPCN Center Name): The Scripps Research Institute Molecular Screening Center (SRIMSC) Center Affiliation: The Scripps Research Institute (TS...
In DepthDetails PCBioAssay