BDBM4584 (2E)-N-{4-[(3-bromophenyl)amino]quinazolin-6-yl}-4-(diethylamino)but-2-enamide::4-anilinoquinazoline deriv. 16b
SMILES CCN(CC)C\C=C\C(=O)Nc1ccc2ncnc(Nc3cccc(Br)c3)c2c1
InChI Key InChIKey=PJDCIIPPRINIGB-RMKNXTFCSA-N
Data  2 IC50
  Tab Delimited (TSV)   2D SDfile   Computed 3D by Vconf -m prep SDfile
Find this compound or compounds like it in BindingDB:
Activity Spreadsheet -- Enzyme Inhibition Constant Data from BindingDB
Found 2 hits for monomerid = 4584
TargetReceptor tyrosine-protein kinase erbB-2(Homo sapiens (Human))
Wyeth-Ayerst Research
LigandPNGBDBM4584((2E)-N-{4-[(3-bromophenyl)amino]quinazolin-6-yl}-4...)
Affinity DataIC50:  1.16E+3nM. Assay description: The HER-2 kinase autophosphorylation activity was measured by DELFIA/time-resolved fluorometry with excitation at 340 nm and emission at 615 nm. Po...
In DepthDetails ArticlePubMed
TargetEpidermal growth factor receptor(Homo sapiens (Human))
Wyeth-Ayerst Research
LigandPNGBDBM4584((2E)-N-{4-[(3-bromophenyl)amino]quinazolin-6-yl}-4...)
Affinity DataIC50:  73nMpH: 7.4 T: 2°C. Assay description: The EGF-R kinase autophosphorylation activity was measured by DELFIA/time-resolved fluorometry with excitation at 340 nm and emission at 615 nm. Po...
In DepthDetails ArticlePubMed