BDBM46081 (3Z)-1-butyl-3-[(2-fluorophenyl)hydrazinylidene]-2-indolone::(3Z)-1-butyl-3-[(2-fluorophenyl)hydrazinylidene]indol-2-one::(3Z)-1-butyl-3-[(2-fluorophenyl)hydrazono]oxindole::MLS-0390912.0001::cid_25181228
SMILES CCCCN1C(=O)C(=NNc2ccccc2F)c2ccccc12
InChI Key InChIKey=VOFVBPJJIUQIGW-UHFFFAOYSA-N
Data  2 IC50
  Tab Delimited (TSV)   2D SDfile   Computed 3D by Vconf -m prep SDfile
Find this compound or compounds like it in BindingDB:
Activity Spreadsheet -- Enzyme Inhibition Constant Data from BindingDB
Found 2 hits for monomerid = 46081
TargetAlkaline phosphatase, germ cell type(Homo sapiens (Human))
Burnham Center For Chemical Genomics
Curated by PubChem BioAssay
LigandPNGBDBM46081((3Z)-1-butyl-3-[(2-fluorophenyl)hydrazinylidene]-2...)
Affinity DataIC50:  7.85E+4nM. Assay description: Data Source: Sanford-Burnham Center for Chemical Genomics (SBCCG) Source Affiliation: Sanford-Burnham Medical Research Institute (SBMRI, San Diego, C...
In DepthDetails PCBioAssay
TargetAlkaline phosphatase, tissue-nonspecific isozyme(Homo sapiens (Human))
Burnham Center For Chemical Genomics
Curated by PubChem BioAssay
LigandPNGBDBM46081((3Z)-1-butyl-3-[(2-fluorophenyl)hydrazinylidene]-2...)
Affinity DataIC50: >1.00E+5nM. Assay description: Sanford-Burnham Center for Chemical Genomics (SBCCG) Sanford-Burnham Medical Research Institute (SBMRI, San Diego, CA) NIH Molecular Libraries Screen...
In DepthDetails PCBioAssay