BDBM46170 6-hydroxy-8-methyl-3a,4,5,9b-tetrahydro-3H-cyclopenta[c]quinoline-4-carboxylic acid ethyl ester::MLS-0111882.0001::cid_16654880::ethyl 6-hydroxy-8-methyl-3a,4,5,9b-tetrahydro-3H-cyclopenta[c]quinoline-4-carboxylate::ethyl 8-methyl-6-oxidanyl-3a,4,5,9b-tetrahydro-3H-cyclopenta[c]quinoline-4-carboxylate
SMILES CCOC(=O)C1Nc2c(O)cc(C)cc2C2C=CCC12
InChI Key InChIKey=VUZIVQROVMBFPJ-UHFFFAOYSA-N
Data  1 IC50
  Tab Delimited (TSV)   2D SDfile   Computed 3D by Vconf -m prep SDfile
Find this compound or compounds like it in BindingDB:
Activity Spreadsheet -- Enzyme Inhibition Constant Data from BindingDB
Found 1 hit for monomerid = 46170
TargetTyrosine-protein phosphatase non-receptor type 7(Homo sapiens (Human))
Burnham Center For Chemical Genomics
Curated by PubChem BioAssay
LigandPNGBDBM46170(6-hydroxy-8-methyl-3a,4,5,9b-tetrahydro-3H-cyclope...)
Affinity DataIC50: >1.00E+5nM. Assay description: Data Source: Sanford-Burnham Center for Chemical Genomics (SBCCG) Source Affiliation: Sanford-Burnham Medical Research Institute (SBMRI, San Diego, C...
In DepthDetails PCBioAssay