BDBM46183 1-[2,3-bis(2-furanyl)-6-quinoxalinyl]-3-(3-methoxyphenyl)urea::1-[2,3-bis(2-furyl)quinoxalin-6-yl]-3-(3-methoxyphenyl)urea::1-[2,3-bis(furan-2-yl)quinoxalin-6-yl]-3-(3-methoxyphenyl)urea::MLS-0202047.0001::cid_2585712
SMILES COc1cccc(NC(=O)Nc2ccc3nc(-c4ccco4)c(nc3c2)-c2ccco2)c1
InChI Key InChIKey=GBSSBKMBTUZDMU-UHFFFAOYSA-N
Data  2 IC50
  Tab Delimited (TSV)   2D SDfile   Computed 3D by Vconf -m prep SDfile
Find this compound or compounds like it in BindingDB:
Activity Spreadsheet -- Enzyme Inhibition Constant Data from BindingDB
Found 2 hits for monomerid = 46183
TargetTyrosine-protein phosphatase non-receptor type 7(Homo sapiens (Human))
Burnham Center For Chemical Genomics
Curated by PubChem BioAssay
LigandPNGBDBM46183(1-[2,3-bis(2-furanyl)-6-quinoxalinyl]-3-(3-methoxy...)
Affinity DataIC50:  1.09E+3nM. Assay description: Data Source: Sanford-Burnham Center for Chemical Genomics (SBCCG) Source Affiliation: Sanford-Burnham Medical Research Institute (SBMRI, San Diego, C...
In DepthDetails PCBioAssay
TargetTyrosine-protein phosphatase non-receptor type 7(Homo sapiens (Human))
Burnham Center For Chemical Genomics
Curated by PubChem BioAssay
LigandPNGBDBM46183(1-[2,3-bis(2-furanyl)-6-quinoxalinyl]-3-(3-methoxy...)
Affinity DataIC50:  2.59E+3nM. Assay description: Data Source: Sanford-Burnham Center for Chemical Genomics (SBCCG) Source Affiliation: Sanford-Burnham Medical Research Institute (SBMRI, San Diego, C...
In DepthDetails PCBioAssay