BDBM46208 (4-amino-3-p-phenetyl-2-thioxo-4-thiazolin-5-yl)-(4-methylpiperazino)methanone::MLS-0267194.0001::[4-amino-3-(4-ethoxyphenyl)-2-sulfanylidene-1,3-thiazol-5-yl]-(4-methylpiperazin-1-yl)methanone::[4-amino-3-(4-ethoxyphenyl)-2-sulfanylidene-5-thiazolyl]-(4-methyl-1-piperazinyl)methanone::[4-azanyl-3-(4-ethoxyphenyl)-2-sulfanylidene-1,3-thiazol-5-yl]-(4-methylpiperazin-1-yl)methanone::cid_1545986
SMILES CCOc1ccc(cc1)-n1c(N)c(sc1=S)C(=O)N1CCN(C)CC1
InChI Key InChIKey=PLKCFOMWSPKGBV-UHFFFAOYSA-N
Data  4 IC50
  Tab Delimited (TSV)   2D SDfile   Computed 3D by Vconf -m prep SDfile
Find this compound or compounds like it in BindingDB:
Activity Spreadsheet -- Enzyme Inhibition Constant Data from BindingDB
Found 4 hits for monomerid = 46208
TargetTyrosine-protein phosphatase non-receptor type 7(Homo sapiens (Human))
Burnham Center For Chemical Genomics
Curated by PubChem BioAssay
LigandPNGBDBM46208((4-amino-3-p-phenetyl-2-thioxo-4-thiazolin-5-yl)-(...)
Affinity DataIC50: >1.00E+5nM. Assay description: Data Source: Sanford-Burnham Center for Chemical Genomics (SBCCG) Source Affiliation: Sanford-Burnham Medical Research Institute (SBMRI, San Diego, C...
In DepthDetails PCBioAssay
TargetTyrosine-protein phosphatase non-receptor type 7(Homo sapiens (Human))
Burnham Center For Chemical Genomics
Curated by PubChem BioAssay
LigandPNGBDBM46208((4-amino-3-p-phenetyl-2-thioxo-4-thiazolin-5-yl)-(...)
Affinity DataIC50:  1.00E+5nM. Assay description: Data Source: Sanford-Burnham Center for Chemical Genomics (SBCCG) Source Affiliation: Sanford-Burnham Medical Research Institute (SBMRI, San Diego, C...
In DepthDetails PCBioAssay
TargetDual specificity protein phosphatase 3(Homo sapiens (Human))
Burnham Center For Chemical Genomics
Curated by PubChem BioAssay
LigandPNGBDBM46208((4-amino-3-p-phenetyl-2-thioxo-4-thiazolin-5-yl)-(...)
Affinity DataIC50: >1.00E+5nM. Assay description: Data Source: Sanford-Burnham Center for Chemical Genomics (SBCCG) Source Affiliation: Sanford-Burnham Medical Research Institute (SBMRI, San Diego, C...
In DepthDetails PCBioAssay
TargetDual specificity protein phosphatase 3(Homo sapiens (Human))
Burnham Center For Chemical Genomics
Curated by PubChem BioAssay
LigandPNGBDBM46208((4-amino-3-p-phenetyl-2-thioxo-4-thiazolin-5-yl)-(...)
Affinity DataIC50: >9.90E+4nM. Assay description: Data Source: Sanford-Burnham Center for Chemical Genomics (SBCCG) Source Affiliation: Sanford-Burnham Medical Research Institute (SBMRI, San Diego, C...
In DepthDetails PCBioAssay