BDBM462098 US10766884, Example A15::US11220494, Example A15
SMILES CS(=O)(=O)N1CC[C@@H](Nc2ncc(Cl)c(n2)-c2cc(F)c3ncn(C4CC4)c3c2)[C@H](O)C1
InChI Key InChIKey=LQDPFXAHJONJIM-NVXWUHKLSA-N
Data  4 KI
  Tab Delimited (TSV)   2D SDfile   Computed 3D by Vconf -m prep SDfile
Find this compound or compounds like it in BindingDB:
Activity Spreadsheet -- Enzyme Inhibition Constant Data from BindingDB
Found 4 hits for monomerid = 462098
TargetCyclin-dependent kinase 4/G1/S-specific cyclin-D1(Homo sapiens (Human))
Pfizer
US Patent
LigandPNGBDBM462098(US10766884, Example A15 | US11220494, Example A15)
Affinity DataKi:  0.300nM. Assay description: CDK4/Cyclin D1: The purpose CDK4/Cyclin D1 assay is to evaluate the inhibition (% inhibition, Kiapp and Ki values) in the presence of small molecule ...
Ligand InfoPC cidPC sid
In DepthDetails US Patent
TargetCyclin-dependent kinase 4/G1/S-specific cyclin-D1(Homo sapiens (Human))
Pfizer
US Patent
LigandPNGBDBM462098(US10766884, Example A15 | US11220494, Example A15)
Affinity DataKi:  0.300nM. Assay description: The purpose CDK4/Cyclin D1 assay is to evaluate the inhibition (% inhibition, Kiapp and Ki values) in the presence of small molecule inhibitors by us...
Ligand InfoPC cidPC sid
In DepthDetails US Patent
TargetCyclin-dependent kinase 6/G1/S-specific cyclin-D3(Homo sapiens (Human))
Pfizer
US Patent
LigandPNGBDBM462098(US10766884, Example A15 | US11220494, Example A15)
Affinity DataKi:  2.40nM. Assay description: The purpose of the CDK6/Cyclin D3 assay is to evaluate the inhibition (% inhibition, Kiapp and Ki values) in the presence of small molecule inhibitor...
Ligand InfoPC cidPC sid
In DepthDetails US Patent
TargetCyclin-dependent kinase 6/G1/S-specific cyclin-D3(Homo sapiens (Human))
Pfizer
US Patent
LigandPNGBDBM462098(US10766884, Example A15 | US11220494, Example A15)
Affinity DataKi:  2.40nM. Assay description: CDK6/Cyclin D3: The purpose of the CDK6/Cyclin D3 assay is to evaluate the inhibition (% inhibition, Kiapp and Ki values) in the presence of small mo...
Ligand InfoPC cidPC sid
In DepthDetails US Patent