BDBM462106 US10766884, Example A23::US10766884, Example A24::US11220494, Example A24
SMILES CC(C)n1c(nc2c(F)cc(cc12)-c1nc(N[C@@H]2CCOC[C@H]2O)ncc1Cl)C(C)(O)C1CC1
InChI Key InChIKey=NTLJHBLBHSTNJY-IYDNLKSRSA-N
Data  8 KI
  Tab Delimited (TSV)   2D SDfile   Computed 3D by Vconf -m prep SDfile
Find this compound or compounds like it in BindingDB:
Activity Spreadsheet -- Enzyme Inhibition Constant Data from BindingDB
Found 8 hits for monomerid = 462106
TargetCyclin-dependent kinase 4/G1/S-specific cyclin-D1(Homo sapiens (Human))
Pfizer
US Patent
LigandPNGBDBM462106(US10766884, Example A23 | US10766884, Example A24 ...)
Affinity DataKi:  0.5nM. Assay description: The purpose CDK4/Cyclin D1 assay is to evaluate the inhibition (% inhibition, Kiapp and Ki values) in the presence of small molecule inhibitors by us...
Ligand InfoPC cidPC sid
In DepthDetails US Patent
TargetCyclin-dependent kinase 4/G1/S-specific cyclin-D1(Homo sapiens (Human))
Pfizer
US Patent
LigandPNGBDBM462106(US10766884, Example A23 | US10766884, Example A24 ...)
Affinity DataKi:  0.5nM. Assay description: CDK4/Cyclin D1: The purpose CDK4/Cyclin D1 assay is to evaluate the inhibition (% inhibition, Kiapp and Ki values) in the presence of small molecule ...
Ligand InfoPC cidPC sid
In DepthDetails US Patent
TargetCyclin-dependent kinase 4/G1/S-specific cyclin-D1(Homo sapiens (Human))
Pfizer
US Patent
LigandPNGBDBM462106(US10766884, Example A23 | US10766884, Example A24 ...)
Affinity DataKi:  1.30nM. Assay description: CDK4/Cyclin D1: The purpose CDK4/Cyclin D1 assay is to evaluate the inhibition (% inhibition, Kiapp and Ki values) in the presence of small molecule ...
Ligand InfoPC cidPC sid
In DepthDetails US Patent
TargetCyclin-dependent kinase 4/G1/S-specific cyclin-D1(Homo sapiens (Human))
Pfizer
US Patent
LigandPNGBDBM462106(US10766884, Example A23 | US10766884, Example A24 ...)
Affinity DataKi:  1.30nM. Assay description: The purpose CDK4/Cyclin D1 assay is to evaluate the inhibition (% inhibition, Kiapp and Ki values) in the presence of small molecule inhibitors by us...
Ligand InfoPC cidPC sid
In DepthDetails US Patent
TargetCyclin-dependent kinase 6/G1/S-specific cyclin-D3(Homo sapiens (Human))
Pfizer
US Patent
LigandPNGBDBM462106(US10766884, Example A23 | US10766884, Example A24 ...)
Affinity DataKi:  11.6nM. Assay description: CDK6/Cyclin D3: The purpose of the CDK6/Cyclin D3 assay is to evaluate the inhibition (% inhibition, Kiapp and Ki values) in the presence of small mo...
Ligand InfoPC cidPC sid
In DepthDetails US Patent
TargetCyclin-dependent kinase 6/G1/S-specific cyclin-D3(Homo sapiens (Human))
Pfizer
US Patent
LigandPNGBDBM462106(US10766884, Example A23 | US10766884, Example A24 ...)
Affinity DataKi:  11.6nM. Assay description: The purpose of the CDK6/Cyclin D3 assay is to evaluate the inhibition (% inhibition, Kiapp and Ki values) in the presence of small molecule inhibitor...
Ligand InfoPC cidPC sid
In DepthDetails US Patent
TargetCyclin-dependent kinase 6/G1/S-specific cyclin-D3(Homo sapiens (Human))
Pfizer
US Patent
LigandPNGBDBM462106(US10766884, Example A23 | US10766884, Example A24 ...)
Affinity DataKi:  16.4nM. Assay description: The purpose of the CDK6/Cyclin D3 assay is to evaluate the inhibition (% inhibition, Kiapp and Ki values) in the presence of small molecule inhibitor...
Ligand InfoPC cidPC sid
In DepthDetails US Patent
TargetCyclin-dependent kinase 6/G1/S-specific cyclin-D3(Homo sapiens (Human))
Pfizer
US Patent
LigandPNGBDBM462106(US10766884, Example A23 | US10766884, Example A24 ...)
Affinity DataKi:  16.4nM. Assay description: CDK6/Cyclin D3: The purpose of the CDK6/Cyclin D3 assay is to evaluate the inhibition (% inhibition, Kiapp and Ki values) in the presence of small mo...
Ligand InfoPC cidPC sid
In DepthDetails US Patent