BDBM46291 4-(2,3-dihydro-1H-benzo[f]cyclopenta[c]quinolin-4-yl)-1,2-benzenediol::MLS000595076::SMR000184811::cid_5718744
SMILES OC1=C\C(C=CC1=O)=C1/Nc2ccc3ccccc3c2C2=C1CCC2
InChI Key InChIKey=PFZLFKVCABOBJU-HMAPJEAMSA-N
Data  1 EC50
  Tab Delimited (TSV)   2D SDfile   Computed 3D by Vconf -m prep SDfile
Find this compound or compounds like it in BindingDB:
Activity Spreadsheet -- Enzyme Inhibition Constant Data from BindingDB
Found 1 hit for monomerid = 46291
TargetEstrogen receptor beta(Homo sapiens (Human))
Nmmlsc
Curated by PubChem BioAssay
LigandPNGBDBM46291(4-(2,3-dihydro-1H-benzo[f]cyclopenta[c]quinolin-4-...)
Affinity DataEC50: >1.00E+4nM. Assay description: University of New Mexico Assay Overview: Assay Support: 1X01 MH077627-01 Assay for Ligands of GPR30 and Classical Estrogen Receptors PI: Eric Prossni...
In DepthDetails PCBioAssay