BDBM46294 4-keto-5-methyl-3H-thieno[2,3-d]pyrimidine-6-carboxylic acid methyl ester::5-Methyl-4-oxo-3,4-dihydro-thieno[2,3-d]pyrimidine-6-carboxylic acid methyl ester::5-methyl-4-oxo-3H-thieno[2,3-d]pyrimidine-6-carboxylic acid methyl ester::MLS000067670::SMR000125022::cid_725279::methyl 5-methyl-4-oxidanylidene-3H-thieno[2,3-d]pyrimidine-6-carboxylate::methyl 5-methyl-4-oxo-3H-thieno[2,3-d]pyrimidine-6-carboxylate
SMILES COC(=O)c1sc2nc[nH]c(=O)c2c1C
InChI Key InChIKey=TUJMJWUVDRWTFM-UHFFFAOYSA-N
Data  1 EC50
  Tab Delimited (TSV)   2D SDfile   Computed 3D by Vconf -m prep SDfile
Find this compound or compounds like it in BindingDB:
Activity Spreadsheet -- Enzyme Inhibition Constant Data from BindingDB
Found 1 hit for monomerid = 46294
TargetGlutathione S-transferase Mu 1(Homo sapiens (Human))
Nmmlsc
Curated by PubChem BioAssay
LigandPNGBDBM46294(4-keto-5-methyl-3H-thieno[2,3-d]pyrimidine-6-carbo...)
Affinity DataEC50:  2.80E+4nM. Assay description: University of New Mexico Assay Overview: Assay Support: NIH 1X01 MH079850-01 HTS to identify small molecule regulators of Bcl-2 family protein int...
In DepthDetails PCBioAssay