BDBM46333 5-amino-3-(cyanomethyl)-1-(3-methylphenyl)-4-pyrazolecarbonitrile::5-amino-3-(cyanomethyl)-1-(3-methylphenyl)pyrazole-4-carbonitrile::5-amino-3-(cyanomethyl)-1-(m-tolyl)pyrazole-4-carbonitrile::5-azanyl-3-(cyanomethyl)-1-(3-methylphenyl)pyrazole-4-carbonitrile::MLS000878028::SMR000376957::cid_2444719
SMILES Cc1cccc(c1)-n1nc(CC#N)c(C#N)c1N
InChI Key InChIKey=SVPIMNKODWXZSK-UHFFFAOYSA-N
Data  1 EC50
  Tab Delimited (TSV)   2D SDfile   Computed 3D by Vconf -m prep SDfile
Find this compound or compounds like it in BindingDB:
Activity Spreadsheet -- Enzyme Inhibition Constant Data from BindingDB
Found 1 hit for monomerid = 46333
LigandPNGBDBM46333(5-amino-3-(cyanomethyl)-1-(3-methylphenyl)-4-pyraz...)
Affinity DataEC50:  2.84E+4nM. Assay description: University of New Mexico Assay Overview: Assay Support: NIH I RO3 MH081231-01 HTS to identify specific small molecule inhibitors of Ras and Ras-rela...
In DepthDetails PCBioAssay