BDBM46353 MLS000109474::N-[4-(1,3-benzoxazol-2-yl)phenyl]-3,5-dimethoxy-benzamide::N-[4-(1,3-benzoxazol-2-yl)phenyl]-3,5-dimethoxybenzamide::SMR000105417::cid_1363858
SMILES COc1cc(OC)cc(c1)C(=O)Nc1ccc(cc1)-c1nc2ccccc2o1
InChI Key InChIKey=JWBPRZWEKRGVEE-UHFFFAOYSA-N
Data  2 IC50
  Tab Delimited (TSV)   2D SDfile   Computed 3D by Vconf -m prep SDfile
Find this compound or compounds like it in BindingDB:
Activity Spreadsheet -- Enzyme Inhibition Constant Data from BindingDB
Found 2 hits for monomerid = 46353
TargetSignal transducer and activator of transcription 1-alpha/beta(Homo sapiens (Human))
The Scripps Research Institute Molecular Screening Center
Curated by PubChem BioAssay
LigandPNGBDBM46353(MLS000109474 | N-[4-(1,3-benzoxazol-2-yl)phenyl]-3...)
Affinity DataIC50: >5.57E+4nM. Assay description: Source (MLPCN Center Name): The Scripps Research Institute Molecular Screening Center Center Affiliation: The Scripps Research Institute (TSRI) Assay...
In DepthDetails PCBioAssay
TargetSignal transducer and activator of transcription 3 [702-738,740-752](Homo sapiens (Human))
The Scripps Research Institute Molecular Screening Center
Curated by PubChem BioAssay
LigandPNGBDBM46353(MLS000109474 | N-[4-(1,3-benzoxazol-2-yl)phenyl]-3...)
Affinity DataIC50:  1.64E+4nM. Assay description: Source (MLPCN Center Name): The Scripps Research Institute Molecular Screening Center Center Affiliation: The Scripps Research Institute (TSRI) Assay...
In DepthDetails PCBioAssay